Target
Lysosomal Pro-X carboxypeptidase
Ligand
BDBM50364689
Substrate
Meas. Tech.
ChEMBL_802882 (CHEMBL1953700)
IC50
0.11±n/a nM
Citation
 Shen, HCDing, FXJiang, JVerras, AChabin, RMXu, STong, XChen, QXie, DLassman, MEBhatt, URGarcia-Calvo, MMGeissler, WShen, ZMurphy, BAGorski, JNWiltsie, JSinhaRoy, RHale, JJPinto, SShen, DM Discovery of benzodihydroisofurans as novel, potent, bioavailable and brain-penetrant prolylcarboxypeptidase inhibitors. Bioorg Med Chem Lett 22:1550-6 (2012)  
Target
Name:
Lysosomal Pro-X carboxypeptidase
Synonyms:
PCP_MOUSE Proline carboxypeptidase | Prolylcarboxypeptidase
Type:
PROTEIN
Mol. Mass.:
55028.96
Organism:
Mus musculus
Description:
ChEMBL_1335505
Residue:
491
  
Inhibitor
Name:
BDBM50364689
Synonyms:
CHEMBL1951478
Type:
Small organic molecule
Emp. Form.:
C23H19ClF3N3O4S
Mol. Mass.:
525.928
SMILES:
[O-][n+]1ccc(Cl)cc1C1OC2(CCN(CC2)S(=O)(=O)c2ccc(cn2)C(F)(F)F)c2ccccc12
: