Target
Nitric oxide synthase, endothelial
Ligand
BDBM50365330
Substrate
Meas. Tech.
ChEMBL_806495 (CHEMBL1959628)
IC50
4160±n/a nM
Citation
 Annedi, SCRamnauth, JMaddaford, SPRenton, PRakhit, SMladenova, GDove, PSilverman, SAndrews, JSFelice, MDPorreca, F Discovery of cis-N-(1-(4-(methylamino)cyclohexyl)indolin-6-yl)thiophene-2-carboximidamide: a 1,6-disubstituted indoline derivative as a highly selective inhibitor of human neuronal nitric oxide synthase (nNOS) without any cardiovascular liabilities. J Med Chem 55:943-55 (2012)  
Target
Name:
Nitric oxide synthase, endothelial
Synonyms:
Constitutive NOS Endothelial NOS NOS3_RAT Nos3 eNOS
Type:
PROTEIN
Mol. Mass.:
133297.24
Organism:
Rattus norvegicus
Description:
ChEMBL_812454
Residue:
1202
  
Inhibitor
Name:
BDBM50365330
Synonyms:
CHEMBL1956107
Type:
Small organic molecule
Emp. Form.:
C20H26N4S
Mol. Mass.:
354.512
SMILES:
CN[C@H]1CC[C@H](CC1)N1CCc2ccc(cc12)N=C(N)c1cccs1
: