Target
Prostaglandin G/H synthase 2
Ligand
BDBM50366167
Substrate
Meas. Tech.
ChEMBL_805635 (CHEMBL1960469)
IC50
13000±n/a nM
Citation
 Sharma, SKAl-Hourani, BJWuest, MMane, JYTuszynski, JBaracos, VSuresh, MWuest, F Synthesis and evaluation of fluorobenzoylated di- and tripeptides as inhibitors of cyclooxygenase-2 (COX-2). Bioorg Med Chem 20:2221-6 (2012)  
Target
Name:
Prostaglandin G/H synthase 2
Synonyms:
COX2 Cyclooxygenase 2 (COX-2) Cyclooxygenase-2 (COX-2 AA) Cyclooxygenase-2 (COX-2) PGH2_HUMAN PHS II Prostaglandin E synthase/G/H synthase 2 Prostaglandin-endoperoxide synthase 2
Type:
Enzyme
Mol. Mass.:
69003.89
Organism:
Homo sapiens (Human)
Description:
Recombinant Cox-2 provided by Cayman (Cayman Chemical Co.,Ann Arbor, MI).
Residue:
604
  
Inhibitor
Name:
BDBM50366167
Synonyms:
CHEMBL1957568
Type:
Small organic molecule
Emp. Form.:
C22H24FN3O6S
Mol. Mass.:
477.506
SMILES:
OC[C@H](NC(=O)[C@H](CS)NC(=O)[C@H](Cc1ccccc1)NC(=O)c1ccc(F)cc1)C(O)=O
: