Target
Tubulin beta-2B chain
Ligand
BDBM50012278
Substrate
Meas. Tech.
ChEBML_211170
Ki
>100000±n/a nM
Citation
 Li, QWoods, KWClaiborne, AGwaltney, SLBarr, KJLiu, GGehrke, LCredo, RBHui, YHLee, JWarner, RBKovar, PNukkala, MAZielinski, NATahir, SKFitzgerald, MKim, KHMarsh, KFrost, DNg, SCRosenberg, SSham, HL Synthesis and biological evaluation of 2-indolyloxazolines as a new class of tubulin polymerization inhibitors. Discovery of A-289099 as an orally active antitumor agent. Bioorg Med Chem Lett 12:465-9 (2002)  
Target
Name:
Tubulin beta-2B chain
Synonyms:
TBB2B_BOVIN Tubulin | Tubulin beta chain
Type:
PROTEIN
Mol. Mass.:
49932.38
Organism:
Bos taurus
Description:
ChEMBL_211651
Residue:
445
  
Inhibitor
Name:
BDBM50012278
Synonyms:
(2ALPHA,2''BETA,3BETA,4ALPHA,5BETA)-VINCALEUKOBLASTINE VINBLASTINE cid_5388983
Type:
Small organic molecule
Emp. Form.:
C46H58N4O9
Mol. Mass.:
810.9741
SMILES:
CC[C@]1(O)C[C@@H]2CN(C1)CCc1c([nH]c3ccccc13)[C@@](C2)(C(=O)OC)c1cc2c(cc1OC)N(C)[C@@H]1[C@]22CCN3CC=C[C@](CC)([C@@H]23)[C@@H](OC(C)=O)[C@]1(O)C(=O)OC
: