Target
Thromboxane-A synthase
Ligand
BDBM50028712
Substrate
Meas. Tech.
ChEBML_210443
IC50
56±n/a nM
Citation
 Iizuka, KAkahane, KMomose, DNakazawa, MTanouchi, TKawamura, MOhyama, IKajiwara, IIguchi, YOkada, TTaniguchi, KMiyamoto, THayashi, M Highly selective inhibitors of thromboxane synthetase. 1. Imidazole derivatives. J Med Chem 24:1139-48 (1982)  
Target
Name:
Thromboxane-A synthase
Synonyms:
CYP5 Cytochrome P450 5A1 TBXAS1 TXA synthase TXS Thromboxane A2 Synthase (P450 TxA2) Thromboxane prostanoid Thromboxane-A synthase
Type:
Enzyme
Mol. Mass.:
60524.67
Organism:
Homo sapiens (Human)
Description:
P24557
Residue:
533
  
Inhibitor
Name:
BDBM50028712
Synonyms:
8-Imidazol-1-yl-oct-6-enoic acid; hydrochloride | CHEMBL542301
Type:
Small organic molecule
Emp. Form.:
C11H16N2O2
Mol. Mass.:
208.2569
SMILES:
OC(=O)CCCC\C=C/Cn1ccnc1
: