Target
Cathepsin G
Ligand
BDBM50005905
Substrate
Meas. Tech.
ChEBML_45341
IC50
55000±n/a nM
Citation
 Zembower, DEKam, CMPowers, JCZalkow, LH Novel anthraquinone inhibitors of human leukocyte elastase and cathepsin G. J Med Chem 35:1597-605 (1992)  
Target
Name:
Cathepsin G
Synonyms:
CATG_HUMAN CTSG
Type:
PROTEIN
Mol. Mass.:
28860.08
Organism:
Homo sapiens (Human)
Description:
ChEMBL_1469016
Residue:
255
  
Inhibitor
Name:
BDBM50005905
Synonyms:
2-Butyl-1-hydroxy-8-methoxy-anthraquinone | CHEMBL43576
Type:
Small organic molecule
Emp. Form.:
C19H18O4
Mol. Mass.:
310.3438
SMILES:
CCCCc1ccc2C(=O)c3cccc(OC)c3C(=O)c2c1O
: