Target
Ornithine decarboxylase
Ligand
BDBM50029366
Substrate
Meas. Tech.
ChEMBL_148132 (CHEMBL753381)
Ki
1790000±n/a nM
Citation
 Aizencang, GFrydman, RBGiorgieri, SSambrotta, LGuerra, LFrydman, B Synthesis of isoornithines and methylputrescines. An evaluation of their inhibitory effects on ornithine decarboxylase. J Med Chem 38:4337-41 (1995)  
Target
Name:
Ornithine decarboxylase
Synonyms:
DCOR_RAT Odc1
Type:
PROTEIN
Mol. Mass.:
51037.04
Organism:
Rattus norvegicus
Description:
ChEMBL_1344641
Residue:
461
  
Inhibitor
Name:
BDBM50029366
Synonyms:
4-Amino-2-aminomethyl-butyric acid | CHEMBL139503
Type:
Small organic molecule
Emp. Form.:
C5H12N2O2
Mol. Mass.:
132.161
SMILES:
NCCC(CN)C(O)=O
: