Target
Adenosine receptor A1
Ligand
BDBM50454490
Substrate
Meas. Tech.
ChEMBL_29171 (CHEMBL637902)
Ki
980±n/a nM
Citation
 Roelen, HVeldman, NSpek, ALvon Frijtag Drabbe Künzel, JMathôt, RAIJzerman, AP N6,C8-distributed adenosine derivatives as partial agonists for adenosine A1 receptors. J Med Chem 39:1463-71 (1996)  
Target
Name:
Adenosine receptor A1
Synonyms:
AA1R_RAT ADENOSINE A1 high Adenosine A1 receptor (A1) Adenosine receptors A1 | Adora1
Type:
Protein
Mol. Mass.:
36704.13
Organism:
Rattus norvegicus (rat)
Description:
Residue:
326
  
Inhibitor
Name:
BDBM50454490
Synonyms:
CHEMBL2113443
Type:
Small organic molecule
Emp. Form.:
C16H24N6O4
Mol. Mass.:
364.3996
SMILES:
CNc1nc2c(NC3CCCC3)ncnc2n1[C@@H]1O[C@H](CO)[C@@H](O)[C@H]1O
: