Target
Inosine-5'-monophosphate dehydrogenase 2
Ligand
BDBM50369293
Substrate
Meas. Tech.
ChEMBL_89934 (CHEMBL699560)
IC50
800±n/a nM
Citation
 Lesiak, KWatanabe, KAMajumdar, ASeidman, MVanderveen, KGoldstein, BMPankiewicz, KW Synthesis of nonhydrolyzable analogues of thiazole-4-carboxamide and benzamide adenine dinucleotide containing fluorine atom at the C2' of adenine nucleoside: induction of K562 differentiation and inosine monophosphate dehydrogenase inhibitory activity. J Med Chem 40:2533-8 (1997)  
Target
Name:
Inosine-5'-monophosphate dehydrogenase 2
Synonyms:
IMDH2_HUMAN IMPD 2 IMPDH-II Inosine 5'-monophosphate dehydrogenase II (IMPDH II) Inosine-5 -monophosphate dehydrogenase 2 | Inosine-5'-monophosphate dehydrogenase (IMPDH)
Type:
Enzyme
Mol. Mass.:
55806.87
Organism:
Homo sapiens (Human)
Description:
Recombinant IMPDH2 expressed in E. coli.
Residue:
514
  
Inhibitor
Name:
BDBM50369293
Synonyms:
CHEMBL608605
Type:
Small organic molecule
Emp. Form.:
C20H24F3N7O12P2S
Mol. Mass.:
705.452
SMILES:
NC(=O)c1csc(n1)C1O[C@H](COP(O)(=O)C(F)(F)P(O)(=O)OC[C@@H]2OC([C@H](F)[C@H]2O)n2cnc3c(N)ncnc23)[C@@H](O)[C@H]1O
: