Target
Sodium- and chloride-dependent GABA transporter 1
Ligand
BDBM50080354
Substrate
Meas. Tech.
ChEMBL_202725 (CHEMBL807623)
Ki
70±n/a nM
Citation
 Knutsen, LJAndersen, KELau, JLundt, BFHenry, RFMorton, HENaerum, LPetersen, HStephensen, HSuzdak, PDSwedberg, MDThomsen, CSørensen, PO Synthesis of novel GABA uptake inhibitors. 3. Diaryloxime and diarylvinyl ether derivatives of nipecotic acid and guvacine as anticonvulsant agents. J Med Chem 42:3447-62 (1999)  
Target
Name:
Sodium- and chloride-dependent GABA transporter 1
Synonyms:
GABA transporter Gat-1 SC6A1_RAT Solute carrier family 6 member 1
Type:
PROTEIN
Mol. Mass.:
67006.26
Organism:
Rattus norvegicus
Description:
ChEMBL_1472611
Residue:
599
  
Inhibitor
Name:
BDBM50080354
Synonyms:
(R)-1-{2-[1-(3-Methyl-thiophen-2-yl)-1-o-tolyl-meth-(Z)-ylideneaminooxy]-ethyl}-piperidine-3-carboxylic acid; hydrochloride | CHEMBL541073
Type:
Small organic molecule
Emp. Form.:
C21H26N2O3S
Mol. Mass.:
386.508
SMILES:
Cc1ccsc1\C(=N/OCCN1CCC[C@H](C1)C(O)=O)c1ccccc1C
: