Target
Glutamyl aminopeptidase
Ligand
BDBM50083388
Substrate
Meas. Tech.
ChEMBL_32830 (CHEMBL873060)
Ki
145±n/a nM
Citation
 David, CBischoff, LMeudal, HMothé, ADe Mota, NDaNascimento, SLlorens-Cortes, CFournié-Zaluski, MCRoques, BP Investigation of subsite preferences in aminopeptidase A (EC 3.4.11.7) led to the design of the first highly potent and selective inhibitors of this enzyme. J Med Chem 42:5197-211 (2000)  
Target
Name:
Glutamyl aminopeptidase
Synonyms:
AMPE_HUMAN Aminopeptidase A Differentiation antigen gp160 ENPEP | Glutamyl aminopeptidase
Type:
PROTEIN
Mol. Mass.:
109226.47
Organism:
Homo sapiens (Human)
Description:
ChEMBL_32829
Residue:
957
  
Inhibitor
Name:
BDBM50083388
Synonyms:
(3R,4R)-5-{[(1S)-1-(aminocarbonyl)-2-methylbutyl]amino}-3-ammonio-4-mercapto-5-oxopentane-1-sulfonate | CHEMBL348192
Type:
Small organic molecule
Emp. Form.:
C11H23N3O5S2
Mol. Mass.:
341.447
SMILES:
CC[C@@H](C)[C@H](NC(=O)[C@H](S)[C@H]([NH3+])CCS([O-])(=O)=O)C(N)=O
: