Target
Ricin
Ligand
BDBM50108010
Substrate
Meas. Tech.
ChEMBL_63579 (CHEMBL677513)
IC50
2200000±n/a nM
Citation
 Miller, DJRavikumar, KShen, HSuh, JKKerwin, SMRobertus, JD Structure-based design and characterization of novel platforms for ricin and shiga toxin inhibition. J Med Chem 45:90-8 (2001)  
Target
Name:
Ricin
Synonyms:
RICI_RICCO
Type:
PROTEIN
Mol. Mass.:
64090.82
Organism:
Ricinus communis
Description:
ChEMBL_1286970
Residue:
576
  
Inhibitor
Name:
BDBM50108010
Synonyms:
2,4-DIAMINO-4,6-DIHYDROXYPYRIMIDINE CHEMBL175083
Type:
Small organic molecule
Emp. Form.:
C4H6N4O2
Mol. Mass.:
142.116
SMILES:
Nc1nc(O)c(N)c(=O)[nH]1
: