Target
Dipeptidyl peptidase 4
Ligand
BDBM50150854
Substrate
Meas. Tech.
ChEMBL_305836 (CHEMBL829577)
IC50
410±n/a nM
Citation
 Ahn, JHKim, HMJung, SHKang, SKKim, KRRhee, SDYang, SDCheon, HGKim, SS Synthesis and DP-IV inhibition of cyano-pyrazoline derivatives as potent anti-diabetic agents. Bioorg Med Chem Lett 14:4461-5 (2004)  
Target
Name:
Dipeptidyl peptidase 4
Synonyms:
ADABP Adenosine deaminase complexing protein 2 CD_antigen=CD26 DPP4 DPPIV Dipeptidyl peptidase 4 (DPP IV) Dipeptidyl peptidase 4 (DPP4) Dipeptidyl peptidase 4 membrane form Dipeptidyl peptidase IV Dipeptidyl peptidase IV (DDP-IV) Dipeptidyl peptidase IV membrane form Dipeptidyl peptidase-IV (DPP-4) T-cell activation antigen CD26 | TP103
Type:
Enzyme
Mol. Mass.:
88271.01
Organism:
Homo sapiens (Human)
Description:
P27487
Residue:
766
  
Inhibitor
Name:
BDBM50150854
Synonyms:
6-(2-(2-(5-cyano-4,5-dihydro-1H-pyrazol-1-yl)-2-oxoethylamino)ethylamino)nicotinonitrile CHEMBL184651 | KR-62436
Type:
Small organic molecule
Emp. Form.:
C14H15N7O
Mol. Mass.:
297.3152
SMILES:
O=C(CNCCNc1ccc(cn1)C#N)N1N=CCC1C#N
: