Target
Dipeptidyl peptidase 4
Ligand
BDBM50150854
Substrate
Meas. Tech.
ChEMBL_305942 (CHEMBL874548)
IC50
800±n/a nM
Citation
 Ahn, JHKim, HMJung, SHKang, SKKim, KRRhee, SDYang, SDCheon, HGKim, SS Synthesis and DP-IV inhibition of cyano-pyrazoline derivatives as potent anti-diabetic agents. Bioorg Med Chem Lett 14:4461-5 (2004)  
Target
Name:
Dipeptidyl peptidase 4
Synonyms:
Bile canaliculus domain-specific membrane glycoprotein Cd26 DPP4_RAT Dipeptidyl peptidase 4 Dipeptidyl peptidase 4 60 kDa soluble form Dipeptidyl peptidase 4 soluble form Dipeptidyl peptidase IV 60 kDa soluble form Dipeptidyl peptidase IV soluble form GP110 glycoprotein | T-cell activation antigen CD26
Type:
Enzyme
Mol. Mass.:
88084.94
Organism:
Rattus norvegicus (rat)
Description:
Residue:
767
  
Inhibitor
Name:
BDBM50150854
Synonyms:
6-(2-(2-(5-cyano-4,5-dihydro-1H-pyrazol-1-yl)-2-oxoethylamino)ethylamino)nicotinonitrile CHEMBL184651 | KR-62436
Type:
Small organic molecule
Emp. Form.:
C14H15N7O
Mol. Mass.:
297.3152
SMILES:
O=C(CNCCNc1ccc(cn1)C#N)N1N=CCC1C#N
: