Target
Dipeptidyl peptidase 4
Ligand
BDBM50150867
Substrate
Meas. Tech.
ChEMBL_305942 (CHEMBL874548)
IC50
1900±n/a nM
Citation
 Ahn, JHKim, HMJung, SHKang, SKKim, KRRhee, SDYang, SDCheon, HGKim, SS Synthesis and DP-IV inhibition of cyano-pyrazoline derivatives as potent anti-diabetic agents. Bioorg Med Chem Lett 14:4461-5 (2004)  
Target
Name:
Dipeptidyl peptidase 4
Synonyms:
Bile canaliculus domain-specific membrane glycoprotein Cd26 DPP4_RAT Dipeptidyl peptidase 4 Dipeptidyl peptidase 4 60 kDa soluble form Dipeptidyl peptidase 4 soluble form Dipeptidyl peptidase IV 60 kDa soluble form Dipeptidyl peptidase IV soluble form GP110 glycoprotein | T-cell activation antigen CD26
Type:
Enzyme
Mol. Mass.:
88084.94
Organism:
Rattus norvegicus (rat)
Description:
Residue:
767
  
Inhibitor
Name:
BDBM50150867
Synonyms:
2-((R)-2-Amino-3-methyl-butyryl)-3,4-dihydro-2H-pyrazole-3-carbonitrile | CHEMBL183721
Type:
Small organic molecule
Emp. Form.:
C9H14N4O
Mol. Mass.:
194.2337
SMILES:
CC(C)[C@@H](N)C(=O)N1N=CCC1C#N
: