Target
Beta-glucosidase A
Ligand
BDBM50156357
Substrate
Meas. Tech.
ChEMBL_305641 (CHEMBL829500)
IC50
80000±n/a nM
Citation
 Godin, GCompain, PMartin, ORIkeda, KYu, LAsano, N Alpha-1-C-alkyl-1-deoxynojirimycin derivatives as potent and selective inhibitors of intestinal isomaltase: remarkable effect of the alkyl chain length on glycosidase inhibitory profile. Bioorg Med Chem Lett 14:5991-5 (2004)  
Target
Name:
Beta-glucosidase A
Synonyms:
BGLS_CALSA | bglA
Type:
PROTEIN
Mol. Mass.:
53484.21
Organism:
Caldocellum saccharolyticum
Description:
ChEMBL_37437
Residue:
455
  
Inhibitor
Name:
BDBM50156357
Synonyms:
2-Hydroxymethyl-1-nonyl-piperidine-3,4,5-triol NN-DNJ
Type:
Small organic molecule
Emp. Form.:
C15H31NO4
Mol. Mass.:
289.4109
SMILES:
CCCCCCCCCN1CC(O)C(O)C(O)C1CO
: