Target
DNA polymerase III PolC-type
Ligand
BDBM50182666
Substrate
Meas. Tech.
ChEMBL_334242 (CHEMBL861887)
Ki
10±n/a nM
Citation
 Zhi, CLong, ZYManikowski, AComstock, JXu, WCBrown, NCTarantino, PMHolm, KADix, EJWright, GEBarnes, MHButler, MMFoster, KALaMarr, WABachand, BBethell, RCadilhac, CCharron, SLamothe, SMotorina, IStorer, R Hybrid antibacterials. DNA polymerase-topoisomerase inhibitors. J Med Chem 49:1455-65 (2006)  
Target
Name:
DNA polymerase III PolC-type
Synonyms:
DNA polymerase III DNA-directed DNA polymerase PolIII mutI | polC
Type:
Enzyme
Mol. Mass.:
162625.67
Organism:
Bacillus subtilis
Description:
Enzyme was purified from recombinant strains.
Residue:
1437
  
Inhibitor
Name:
BDBM50182666
Synonyms:
3-{4-[1-(1-cyclopropyl-3-carboxy-4-oxo-6-fluoro-8-chloro-7-quinolyl)-4-piperazinyl]butyl}-6-(3-ethyl-4-methylanilino)-uracil | CHEMBL373063
Type:
Small organic molecule
Emp. Form.:
C34H38ClFN6O5
Mol. Mass.:
665.154
SMILES:
CCc1cc(Nc2cc(=O)n(CCCCN3CCN(CC3)c3c(F)cc4c(c3Cl)n(cc(C(O)=O)c4=O)C3CC3)c(=O)[nH]2)ccc1C
: