Target
ATP-dependent translocase ABCB1
Ligand
BDBM23928
Substrate
Meas. Tech.
ChEMBL_353612 (CHEMBL861699)
IC50
8000±n/a nM
Citation
 Roberti, MPizzirani, DRecanatini, MSimoni, DGrimaudo, SDi Cristina, AAbbadessa, VGebbia, NTolomeo, M Identification of a terphenyl derivative that blocks the cell cycle in the G0-G1 phase and induces differentiation in leukemia cells. J Med Chem 49:3012-8 (2006)  
Target
Name:
ATP-dependent translocase ABCB1
Synonyms:
ABCB1 MDR1_HUMAN Multidrug resistance protein 1 P-glycoprotein (P-gp) PGY1
Type:
Protein
Mol. Mass.:
141503.50
Organism:
Homo sapiens (Human)
Description:
P08183
Residue:
1280
  
Inhibitor
Name:
BDBM23928
Synonyms:
1,3-dimethoxy-5-[(E)-2-(4-methoxyphenyl)ethenyl]benzene trans-Stilbene Derivative, 4a
Type:
Small organic molecule
Emp. Form.:
C17H18O3
Mol. Mass.:
270.323
SMILES:
COc1ccc(\C=C\c2cc(OC)cc(OC)c2)cc1
: