Target
RNA-directed RNA polymerase
Ligand
BDBM50199047
Substrate
Meas. Tech.
ChEMBL_411597 (CHEMBL907248)
IC50
41±n/a nM
Citation
 Ikegashira, KOka, THirashima, SNoji, SYamanaka, HHara, YAdachi, TTsuruha, JDoi, SHase, YNoguchi, TAndo, IOgura, NIkeda, SHashimoto, H Discovery of conformationally constrained tetracyclic compounds as potent hepatitis C virus NS5B RNA polymerase inhibitors. J Med Chem 49:6950-3 (2006)  
Target
Name:
RNA-directed RNA polymerase
Synonyms:
Hepatitis C virus NS5B RNA-dependent RNA polymerase | NS5B protein
Type:
Protein
Mol. Mass.:
25173.95
Organism:
Hepatitis C virus
Description:
Q8JXU8
Residue:
229
  
Inhibitor
Name:
BDBM50199047
Synonyms:
13-cyclohexyl-5-benzyl-6,7-dihydro-5H-benzo[5,6][1,4]diazepino[7,1-a]indole-10-carboxylic acid | CHEMBL440992
Type:
Small organic molecule
Emp. Form.:
C30H30N2O2
Mol. Mass.:
450.5714
SMILES:
OC(=O)c1ccc2c(C3CCCCC3)c3-c4ccccc4N(Cc4ccccc4)CCn3c2c1
: