Target
Dipeptidyl peptidase 4
Ligand
BDBM50198842
Substrate
Meas. Tech.
ChEMBL_432851 (CHEMBL915600)
IC50
34.1±n/a nM
Citation
 Sakashita, HAkahoshi, FYoshida, TKitajima, HHayashi, YIshii, STakashina, YTsutsumiuchi, ROno, S Lead optimization of [(S)-gamma-(arylamino)prolyl]thiazolidine focused on gamma-substituent: Indoline compounds as potent DPP-IV inhibitors. Bioorg Med Chem 15:641-55 (2006)  
Target
Name:
Dipeptidyl peptidase 4
Synonyms:
Bile canaliculus domain-specific membrane glycoprotein Cd26 DPP4_RAT Dipeptidyl peptidase 4 Dipeptidyl peptidase 4 60 kDa soluble form Dipeptidyl peptidase 4 soluble form Dipeptidyl peptidase IV 60 kDa soluble form Dipeptidyl peptidase IV soluble form GP110 glycoprotein | T-cell activation antigen CD26
Type:
Enzyme
Mol. Mass.:
88084.94
Organism:
Rattus norvegicus (rat)
Description:
Residue:
767
  
Inhibitor
Name:
BDBM50198842
Synonyms:
3-[(2S,4S)-4-(4-cyanobenzoyl)amino-2-pyrrolidinylcarbonyl]-1,3-thiazolidine | CHEMBL441559
Type:
Small organic molecule
Emp. Form.:
C16H18N4O2S
Mol. Mass.:
330.405
SMILES:
O=C(N[C@@H]1CN[C@@H](C1)C(=O)N1CCSC1)c1ccc(cc1)C#N
: