Target
3-oxoacyl-[acyl-carrier-protein] synthase 3
Ligand
BDBM50220634
Substrate
Meas. Tech.
ChEMBL_457362 (CHEMBL940953)
IC50
68000±n/a nM
Citation
 Bhowruth, VBrown, AKSenior, SJSnaith, JSBesra, GS Synthesis and biological evaluation of a C5-biphenyl thiolactomycin library. Bioorg Med Chem Lett 17:5643-6 (2007)  
Target
Name:
3-oxoacyl-[acyl-carrier-protein] synthase 3
Synonyms:
β-Ketoacyl-acyl carrier protein (ACP) synthase III (FabH) FABH_MYCTU | fabH
Type:
Enzyme
Mol. Mass.:
34865.07
Organism:
Mycobacterium tuberculosis
Description:
P9WNG3
Residue:
335
  
Inhibitor
Name:
BDBM50220634
Synonyms:
4-hydroxy-3,5-dimethyl-5-[1,1';4',1'']terphenyl-4-ylmethyl-5H-thiophen-2-one | CHEMBL250819
Type:
Small organic molecule
Emp. Form.:
C25H22O2S
Mol. Mass.:
386.506
SMILES:
CC1C(=O)SC(C)(Cc2ccc(cc2)-c2ccc(cc2)-c2ccccc2)C1=O
: