Target
Voltage-dependent T-type calcium channel subunit alpha-1H
Ligand
BDBM50373620
Substrate
Meas. Tech.
ChEMBL_468020 (CHEMBL947231)
IC50
180±n/a nM
Citation
 Hangeland, JJCheney, DLFriends, TJSwartz, SLevesque, PCRich, AJSun, LBridal, TRAdam, LPNormandin, DEMurugesan, NEwing, WR Design and SAR of selective T-type calcium channel antagonists containing a biaryl sulfonamide core. Bioorg Med Chem Lett 18:474-8 (2008)  
Target
Name:
Voltage-dependent T-type calcium channel subunit alpha-1H
Synonyms:
CAC1H_HUMAN Low-voltage-activated calcium channel alpha1 3.2 subunit Voltage-gated calcium channel voltage-dependent T-type calcium channel subunit alpha-1H isoform a
Type:
Enzyme Catalytic Domain
Mol. Mass.:
259187.68
Organism:
Homo sapiens (Human)
Description:
Calcium channel (Type T,L) 0 0::O95180
Residue:
2353
  
Inhibitor
Name:
BDBM50373620
Synonyms:
CHEMBL269980
Type:
Small organic molecule
Emp. Form.:
C29H34ClN3O5S
Mol. Mass.:
572.115
SMILES:
CC(C)CCCN(c1cccc(Cl)c1)S(=O)(=O)c1cccc(NC(=O)CN(C)C(=O)OCc2ccccc2)c1
: