Target
Vascular endothelial growth factor receptor 2
Ligand
BDBM50374614
Substrate
Meas. Tech.
ChEMBL_469611 (CHEMBL934190)
IC50
480±n/a nM
Citation
 Martin, MWNewcomb, JNunes, JJBoucher, CChai, LEpstein, LFFaust, TFlores, SGallant, PGore, AGu, YHsieh, FHuang, XKim, JLMiddleton, SMorgenstern, KOliveira-dos-Santos, APatel, VFPowers, DRose, PTudor, YTurci, SMWelcher, AAZack, DZhao, HZhu, LZhu, XGhiron, CErmann, MJohnston, DSaluste, CG Structure-based design of novel 2-amino-6-phenyl-pyrimido[5',4':5,6]pyrimido[1,2-a]benzimidazol-5(6H)-ones as potent and orally active inhibitors of lymphocyte specific kinase (Lck): synthesis, SAR, and in vivo anti-inflammatory activity. J Med Chem 51:1637-48 (2008)  
Target
Name:
Vascular endothelial growth factor receptor 2
Synonyms:
CD_antigen=CD309 Fetal liver kinase 1 (FLK-1) KDR Protein-tyrosine kinase receptor Flk-1 VEGFR-2 VEGFR2 Vascular Endothelial Growth Factor Receptor Kinase 2 Vascular endothelial growth factor receptor 2 (KDR) Vascular endothelial growth factor receptor 2 (VEGFR2) Vascular endothelial growth factor receptor-2 (VEGFR-2)
Type:
Receptor Tyrosine Kinase
Mol. Mass.:
151510.97
Organism:
Homo sapiens (Human)
Description:
P35968
Residue:
1356
  
Inhibitor
Name:
BDBM50374614
Synonyms:
CHEMBL254674
Type:
Small organic molecule
Emp. Form.:
C29H23Cl3N8O
Mol. Mass.:
605.905
SMILES:
CN1CCN(CC1)c1ccc(Nc2ncc3c(n2)n2c4ccccc4nc2n(-c2c(Cl)cc(Cl)cc2Cl)c3=O)cc1
: