Target
Adenosine receptor A2b
Ligand
BDBM50375415
Substrate
Meas. Tech.
ChEMBL_471789 (CHEMBL939997)
Ki
1±n/a nM
Citation
 Stefanachi, ABrea, JMCadavid, MICenteno, NBEsteve, CLoza, MIMartinez, ANieto, RRaviña, ESanz, FSegarra, VSotelo, EVidal, BCarotti, A 1-, 3- and 8-substituted-9-deazaxanthines as potent and selective antagonists at the human A2B adenosine receptor. Bioorg Med Chem 16:2852-69 (2008)  
Target
Name:
Adenosine receptor A2b
Synonyms:
AA2BR_HUMAN ADORA2B Adenosine receptors A2b | Adenosine receptors; A2a & A2b
Type:
G Protein-Coupled Receptor (GPCR)
Mol. Mass.:
36341.22
Organism:
Homo sapiens (Human)
Description:
Residue:
332
  
Inhibitor
Name:
BDBM50375415
Synonyms:
CHEMBL259479
Type:
Small organic molecule
Emp. Form.:
C31H33ClN6O4S
Mol. Mass.:
621.15
SMILES:
CCCn1c2cc([nH]c2c(=O)n(C)c1=O)-c1ccc(OC(C)(C)C(=O)N2CCN(CC2)c2nc3ccc(Cl)cc3s2)cc1
: