Target
Mitogen-activated protein kinase 14
Ligand
BDBM50375790
Substrate
Meas. Tech.
ChEMBL_474267 (CHEMBL935072)
IC50
0.12±n/a nM
Citation
 Chen, MHFitzgerald, PSingh, SBO'Neill, EASchwartz, CDThompson, CMO'Keefe, SJZaller, DMDoherty, JB Synthesis and biological activity of quinolinone and dihydroquinolinone p38 MAP kinase inhibitors. Bioorg Med Chem Lett 18:2222-6 (2008)  
Target
Name:
Mitogen-activated protein kinase 14
Synonyms:
CSAID-binding protein CSBP1 CSPB1 MAP kinase 14 MAP kinase p38 alpha MAPK14 MK14_HUMAN Mitogen-activated protein kinase p38 alpha Stress-activated protein kinase 2a | p38 MAP kinase alpha/beta
Type:
Serine/threonine-protein kinase
Mol. Mass.:
41286.76
Organism:
Homo sapiens (Human)
Description:
Q16539
Residue:
360
  
Inhibitor
Name:
BDBM50375790
Synonyms:
CHEMBL270004
Type:
Small organic molecule
Emp. Form.:
C27H24Cl3N3O3
Mol. Mass.:
544.857
SMILES:
CC(C)(N)C(=O)NCCOc1cc(-c2ccccc2Cl)c2ccc(=O)n(-c3c(Cl)cccc3Cl)c2c1
: