Target
5-hydroxytryptamine receptor 7
Ligand
BDBM50375931
Substrate
Meas. Tech.
ChEMBL_474639 (CHEMBL921838)
IC50
110±n/a nM
Citation
 Na, YHHong, SHLee, JHPark, WKBaek, DJKoh, HYCho, YSChoo, HPae, AN Novel quinazolinone derivatives as 5-HT7 receptor ligands. Bioorg Med Chem 16:2570-8 (2008)  
Target
Name:
5-hydroxytryptamine receptor 7
Synonyms:
5-HT-7 5-HT7 5-HT7S 5HT7 HTR7 | Serotonin receptor 7
Type:
G Protein-Coupled Receptor (GPCR)
Mol. Mass.:
53573.08
Organism:
Homo sapiens (Human)
Description:
P34969
Residue:
479
  
Inhibitor
Name:
BDBM50375931
Synonyms:
CHEMBL260514
Type:
Small organic molecule
Emp. Form.:
C32H36FN5O4
Mol. Mass.:
573.6577
SMILES:
CCOc1ccccc1N1CCN(CCCC(=O)NCc2nc3cc(F)ccc3c(=O)n2-c2ccccc2OC)CC1
: