Target
Cholesteryl ester transfer protein
Ligand
BDBM50376713
Substrate
Meas. Tech.
ChEMBL_477678 (CHEMBL924744)
IC50
3200±n/a nM
Citation
 Harikrishnan, LSKamau, MGHerpin, TFMorton, GCLiu, YCooper, CBSalvati, MEQiao, JXWang, TCAdam, LPTaylor, DSChen, AYYin, XSeethala, RPeterson, TLNirschl, DSMiller, AVWeigelt, CAAppiah, KKO'Connell, JCMichael Lawrence, R 2-Arylbenzoxazoles as novel cholesteryl ester transfer protein inhibitors: optimization via array synthesis. Bioorg Med Chem Lett 18:2640-4 (2008)  
Target
Name:
Cholesteryl ester transfer protein
Synonyms:
CETP Cholesteryl ester transfer protein (CETP) | Lipid transfer protein I
Type:
Enzyme
Mol. Mass.:
54751.53
Organism:
Homo sapiens (Human)
Description:
P11597
Residue:
493
  
Inhibitor
Name:
BDBM50376713
Synonyms:
CHEMBL259710
Type:
Small organic molecule
Emp. Form.:
C25H18ClN3O3
Mol. Mass.:
443.882
SMILES:
Clc1ccc(OCC(=O)Nc2ccc(cc2)-c2nc3cc(ccc3o2)C#N)c2CCCc12
: