Target
C5a anaphylatoxin chemotactic receptor 1
Ligand
BDBM50376830
Substrate
Meas. Tech.
ChEMBL_477916 (CHEMBL923541)
IC50
>10000±n/a nM
Citation
 Barbay, JKGong, YBuntinx, MLi, JClaes, CHornby, PJVan Lommen, GVan Wauwe, JHe, W Synthesis and characterization of 5,6,7,8-tetrahydroquinoline C5a receptor antagonists. Bioorg Med Chem Lett 18:2544-8 (2008)  
Target
Name:
C5a anaphylatoxin chemotactic receptor 1
Synonyms:
C5AR C5AR1_HUMAN C5a anaphylatoxin chemotactic receptor C5a-R | CD_antigen=CD88
Type:
Enzyme
Mol. Mass.:
39347.68
Organism:
Homo sapiens (Human)
Description:
P21730
Residue:
350
  
Inhibitor
Name:
BDBM50376830
Synonyms:
CHEMBL258967
Type:
Small organic molecule
Emp. Form.:
C31H34N2
Mol. Mass.:
434.6151
SMILES:
CCN(C1CCCc2nc(ccc12)-c1c(CC)cccc1CC)c1cccc2ccccc12
: