Target
5-hydroxytryptamine receptor 3A
Ligand
BDBM29135
Substrate
Meas. Tech.
ChEMBL_478755 (CHEMBL923632)
EC50
26000±n/a nM
Citation
 Petrascheck, MYe, XBuck, LB An antidepressant that extends lifespan in adult Caenorhabditis elegans. Nature 450:553-556 (2007)  
Target
Name:
5-hydroxytryptamine receptor 3A
Synonyms:
5-HT-3 5-HT3A 5-hydroxytryptamine receptor 3 (5-HT3) 5-hydroxytryptamine receptor 3A (5HT3A) 5HT3R HTR3A Serotonin 3 receptor (5HT3) Serotonin-gated ion channel receptor | Serotonin-gated ion channel receptor 3
Type:
Protein
Mol. Mass.:
55283.27
Organism:
Homo sapiens (Human)
Description:
P46098
Residue:
478
  
Inhibitor
Name:
BDBM29135
Synonyms:
CHEMBL11608 p-Tyramine | tyramine
Type:
Small organic molecule
Emp. Form.:
C8H11NO
Mol. Mass.:
137.179
SMILES:
NCCc1ccc(O)cc1
: