Target
Cytochrome P450 3A4
Ligand
BDBM50377214
Substrate
Meas. Tech.
ChEMBL_479364 (CHEMBL921647)
IC50
2700±n/a nM
Citation
 McAtee, JJDodson, JWDowdell, SEGirard, GRGoodman, KBHilfiker, MASehon, CASha, DWang, GZWang, NViet, AQZhang, DAiyar, NVBehm, DJCarballo, LHEvans, CAFries, HENagilla, RRoethke, TJXu, XYuan, CCDouglas, SANeeb, MJ Development of potent and selective small-molecule human Urotensin-II antagonists. Bioorg Med Chem Lett 18:3500-3 (2008)  
Target
Name:
Cytochrome P450 3A4
Synonyms:
Albendazole monooxygenase CP3A4_HUMAN CYP3A4 CYPIIIA4 Cytochrome P450 3A4 (CYP3A4) Nifedipine oxidase Taurochenodeoxycholate 6-alpha-hydroxylase
Type:
Enzyme
Mol. Mass.:
57349.57
Organism:
Homo sapiens (Human)
Description:
Residue:
503
  
Inhibitor
Name:
BDBM50377214
Synonyms:
CHEMBL256721
Type:
Small organic molecule
Emp. Form.:
C28H34N4O3
Mol. Mass.:
474.5946
SMILES:
Cc1cc2ncc(=O)n(CC(=O)N3CCCC(C3CN3CCOCC3)c3ccccc3)c2cc1C
: