Target
Sucrase-isomaltase, intestinal
Ligand
BDBM50240725
Substrate
Meas. Tech.
ChEMBL_490824 (CHEMBL993563)
IC50
460000±n/a nM
Citation
 Kuriyama, CKamiyama, OIkeda, KSanae, FKato, AAdachi, IImahori, TTakahata, HOkamoto, TAsano, N In vitro inhibition of glycogen-degrading enzymes and glycosidases by six-membered sugar mimics and their evaluation in cell cultures. Bioorg Med Chem 16:7330-6 (2008)  
Target
Name:
Sucrase-isomaltase, intestinal
Synonyms:
SUIS_RAT Sucrase-isomaltase | alpha-Glucosidase (α-Glucosidase)
Type:
Enzyme
Mol. Mass.:
210329.04
Organism:
Rattus norvegicus (Rat)
Description:
P23739
Residue:
1841
  
Inhibitor
Name:
BDBM50240725
Synonyms:
(2R,3R,4R)-2-Hydroxymethyl-piperidine-3,4-diol Fagomine
Type:
Small organic molecule
Emp. Form.:
C6H13NO3
Mol. Mass.:
147.1723
SMILES:
OC[C@H]1NCC[C@@H](O)[C@@H]1O
: