Target
B-cell receptor CD22
Ligand
BDBM50378465
Substrate
Meas. Tech.
ChEMBL_599602 (CHEMBL1040214)
IC50
305200±n/a nM
Citation
 Abdu-Allah, HHWatanabe, KHayashizaki, KTakaku, CTamanaka, TTakematsu, HKozutsumi, YTsubata, TIshida, HKiso, M Potent small molecule mouse CD22-inhibitors: exploring the interaction of the residue at C-2 of sialic acid scaffold. Bioorg Med Chem Lett 19:5573-5 (2009)  
Target
Name:
B-cell receptor CD22
Synonyms:
B-lymphocyte cell adhesion molecule CD22_MOUSE Cd22 Sialic acid-binding Ig-like lectin 2 Siglec2 | T-cell surface antigen Leu-14
Type:
PROTEIN
Mol. Mass.:
96597.27
Organism:
Mus musculus
Description:
ChEMBL_727025
Residue:
862
  
Inhibitor
Name:
BDBM50378465
Synonyms:
CHEMBL569217
Type:
Small organic molecule
Emp. Form.:
C24H35NO16
Mol. Mass.:
593.5318
SMILES:
COc1ccc(O[C@@H]2O[C@H](CO[C@@]3(C[C@H](O)[C@H](NC(=O)CO)[C@@H](O3)[C@H](O)[C@H](O)CO)C(O)=O)[C@H](O)[C@H](O)[C@H]2O)cc1
: