Target
5'-nucleotidase
Ligand
BDBM50378649
Substrate
Meas. Tech.
ChEMBL_612633 (CHEMBL1065670)
Ki
1470±n/a nM
Citation
 Baqi, YLee, SYIqbal, JRipphausen, PLehr, AScheiff, ABZimmermann, HBajorath, JMüller, CE Development of potent and selective inhibitors of ecto-5'-nucleotidase based on an anthraquinone scaffold. J Med Chem 53:2076-86 (2010)  
Target
Name:
5'-nucleotidase
Synonyms:
5'-nucleotidase Ecto-5'-nucleotidase (e5'NT) NT Nt5e | Nte
Type:
Enzyme
Mol. Mass.:
63971.44
Organism:
Rattus norvegicus (Rat)
Description:
P21588
Residue:
576
  
Inhibitor
Name:
BDBM50378649
Synonyms:
CHEMBL597197
Type:
Small organic molecule
Emp. Form.:
C24H15N2O5S
Mol. Mass.:
443.452
SMILES:
Nc1c2C(=O)c3ccccc3C(=O)c2c(Nc2ccc3ccccc3c2)cc1S([O-])(=O)=O
: