Target
P2Y purinoceptor 6
Ligand
BDBM50307835
Substrate
Meas. Tech.
ChEMBL_612835 (CHEMBL1067524)
IC50
10000±n/a nM
Citation
 Baqi, YLee, SYIqbal, JRipphausen, PLehr, AScheiff, ABZimmermann, HBajorath, JMüller, CE Development of potent and selective inhibitors of ecto-5'-nucleotidase based on an anthraquinone scaffold. J Med Chem 53:2076-86 (2010)  
Target
Name:
P2Y purinoceptor 6
Synonyms:
P2RY6_RAT Pyrimidinergic receptor P2Y6
Type:
PROTEIN
Mol. Mass.:
36704.21
Organism:
Rattus norvegicus
Description:
ChEMBL_805344
Residue:
328
  
Inhibitor
Name:
BDBM50307835
Synonyms:
CHEMBL590956 | Sodium 1-amino-4-[4-fluoro-2-carboxyphenylamino]-9,10-dioxo-9,10-dihydroanthracene-2-sulfonate
Type:
Small organic molecule
Emp. Form.:
C21H12FN2O7S
Mol. Mass.:
455.393
SMILES:
Nc1c(cc(Nc2ccc(F)cc2C(O)=O)c2C(=O)c3ccccc3C(=O)c12)S([O-])(=O)=O
: