Target
Epidermal growth factor receptor
Ligand
BDBM3032
Substrate
Meas. Tech.
ChEMBL_627419 (CHEMBL1115349)
IC50
230±n/a nM
Citation
 Gangjee, AZaware, NRaghavan, SIhnat, MShenoy, SKisliuk, RL Single agents with designed combination chemotherapy potential: synthesis and evaluation of substituted pyrimido[4,5-b]indoles as receptor tyrosine kinase and thymidylate synthase inhibitors and as antitumor agents. J Med Chem 53:1563-78 (2010)  
Target
Name:
Epidermal growth factor receptor
Synonyms:
EGF Receptor Substrate EGFR_HUMAN ERBB1 Epidermal Growth Factor Receptor erbB-1 Epidermal growth factor receptor (EGFR) HER1 Proto-oncogene c-ErbB-1 Tyrosine-Protein Kinase ErbB-1
Type:
Receptor Kinase Domain
Mol. Mass.:
134279.59
Organism:
Homo sapiens (Human)
Description:
P00533
Residue:
1210
  
Inhibitor
Name:
BDBM3032
Synonyms:
CHEMBL1204168 N-(3-bromophenyl)-6,7-dimethoxyquinazolin-4-amine US11001595, Compound PD153035 US9422297, PD153035
Type:
Small organic molecule
Emp. Form.:
C16H14BrN3O2
Mol. Mass.:
360.205
SMILES:
COc1cc2ncnc(Nc3cccc(Br)c3)c2cc1OC
: