Target
Aurora kinase B
Ligand
BDBM50316474
Substrate
Meas. Tech.
ChEMBL_630516 (CHEMBL1104788)
IC50
2.1±n/a nM
Citation
Target
Name:
Aurora kinase B
Synonyms:
AIK2 AIM1 ARK2 AURKB_HUMAN Aurora B-INCENP Aurora kinase B (AURKB) STK-1 STK12 Serine/threonine-protein kinase aurora B
Type:
Protein
Mol. Mass.:
39327.72
Organism:
Homo sapiens (Human)
Description:
Q96GD4
Residue:
344
  
Inhibitor
Name:
BDBM50316474
Synonyms:
4-[3-(4-N,N-Dimethylcarbamylaminophenyl)-1-ethyl-1H-pyrazol-4-yl]-2-[3-(N-pyrrolidinylmethyl)phenyl]-1H-pyrrolo[2,3-b]-pyridine | CHEMBL1095788
Type:
Small organic molecule
Emp. Form.:
C32H35N7O
Mol. Mass.:
533.6666
SMILES:
CCn1cc(c(n1)-c1ccc(NC(=O)N(C)C)cc1)-c1ccnc2[nH]c(cc12)-c1cccc(CN2CCCC2)c1
: