Target
Glucagon receptor
Ligand
BDBM50324702
Substrate
Meas. Tech.
ChEMBL_651179 (CHEMBL1227944)
EC50
0.049±n/a nM
Citation
 Day, JWOttaway, NPatterson, JTGelfanov, VSmiley, DGidda, JFindeisen, HBruemmer, DDrucker, DJChaudhary, NHolland, JHembree, JAbplanalp, WGrant, ERuehl, JWilson, HKirchner, HLockie, SHHofmann, SWoods, SCNogueiras, RPfluger, PTPerez-Tilve, DDiMarchi, RTschöp, MH A new glucagon and GLP-1 co-agonist eliminates obesity in rodents. Nat Chem Biol 5:749-57 (2009)  
Target
Name:
Glucagon receptor
Synonyms:
GCGR GLR_HUMAN Glucagon receptor (GlucR)
Type:
Enzyme
Mol. Mass.:
54026.92
Organism:
Homo sapiens (Human)
Description:
P47871
Residue:
477
  
Inhibitor
Name:
BDBM50324702
Synonyms:
CHEMBL1222076
Type:
Small organic molecule
Emp. Form.:
C155H227N43O50S
Mol. Mass.:
3524.784
SMILES:
CSCC[C@H](NC(=O)[C@H](CC(C)C)NC(=O)[C@H](Cc1c[nH]c2ccccc12)NC(=O)[C@H](CCC(N)=O)NC(=O)[C@@H](NC(=O)[C@H](Cc1ccccc1)NC(=O)[C@H](CC(O)=O)NC(=O)[C@H](CCC(N)=O)NC(=O)[C@H](C)NC(=O)[C@H](CCCN=C(N)N)NC(=O)[C@H](CCCN=C(N)N)NC(=O)[C@H](CCC(O)=O)NC(=O)[C@H](CC(O)=O)NC(=O)[C@H](CC(C)C)NC(=O)[C@H](Cc1ccc(O)cc1)NC(=O)[C@H](CCCCN)NC(=O)[C@H](CO)NC(=O)[C@H](Cc1ccc(O)cc1)NC(=O)[C@H](CC(O)=O)NC(=O)[C@H](CO)NC(=O)[C@@H](NC(=O)[C@H](Cc1ccccc1)NC(=O)[C@@H](NC(=O)CNC(=O)[C@H](CCC(N)=O)NC(=O)[C@H](CO)N[C@@H](Cc1cnc[nH]1)C(O)=O)[C@@H](C)O)[C@@H](C)O)C(C)C)C(=O)N[C@@H](CC(N)=O)C(=O)N[C@@H]([C@@H](C)O)C(N)=O
: