Target
Glutathione reductase, mitochondrial
Ligand
BDBM50336640
Substrate
Meas. Tech.
ChEMBL_767322 (CHEMBL1825434)
IC50
23400±n/a nM
Citation
 Çakmak, RDurdagi, SEkinci, DSentürk, MTopal, G Design, synthesis and biological evaluation of novel nitroaromatic compounds as potent glutathione reductase inhibitors. Bioorg Med Chem Lett 21:5398-402 (2011)  
Target
Name:
Glutathione reductase, mitochondrial
Synonyms:
GLUR GSHR_HUMAN Glutathione reductase | Glutathione reductase (GR)
Type:
Enzyme
Mol. Mass.:
56271.52
Organism:
Homo sapiens (Human)
Description:
P00390
Residue:
522
  
Inhibitor
Name:
BDBM50336640
Synonyms:
(nifedipine) 2,6-Dimethyl-4-(2-nitro-phenyl)-1,4-dihydro-pyridine-3,5-dicarboxylic acid dimethyl ester Adalat Afeditab cr NIFEDIPINE Procardia dimethyl 2,6-dimethyl-4-(2-nitrophenyl)-1,4-dihydropyridine-3,5-dicarboxylate
Type:
Small organic molecule
Emp. Form.:
C17H18N2O6
Mol. Mass.:
346.3346
SMILES:
COC(=O)C1C(C(C(=O)OC)=C(C)N=C1C)c1ccccc1[N+]([O-])=O
: