Target
Glutathione reductase, mitochondrial
Ligand
BDBM50352164
Substrate
Meas. Tech.
ChEMBL_767323 (CHEMBL1825435)
Ki
211±n/a nM
Citation
 Çakmak, RDurdagi, SEkinci, DSentürk, MTopal, G Design, synthesis and biological evaluation of novel nitroaromatic compounds as potent glutathione reductase inhibitors. Bioorg Med Chem Lett 21:5398-402 (2011)  
Target
Name:
Glutathione reductase, mitochondrial
Synonyms:
GLUR GSHR_HUMAN Glutathione reductase | Glutathione reductase (GR)
Type:
Enzyme
Mol. Mass.:
56271.52
Organism:
Homo sapiens (Human)
Description:
P00390
Residue:
522
  
Inhibitor
Name:
BDBM50352164
Synonyms:
CHEMBL1824793
Type:
Small organic molecule
Emp. Form.:
C12H12N2O7
Mol. Mass.:
296.2329
SMILES:
OC(=O)CC[C@H](NC(=O)c1ccc(cc1)[N+]([O-])=O)C(O)=O
: