Target
Cytochrome P450 2D6
Ligand
BDBM50379197
Substrate
Meas. Tech.
ChEMBL_811052 (CHEMBL2014632)
IC50
>20000±n/a nM
Citation
 Chen, KXVibulbhan, BYang, WSannigrahi, MVelazquez, FChan, TYVenkatraman, SAnilkumar, GNZeng, QBennet, FJiang, YLesburg, CADuca, JPinto, PGavalas, SHuang, YWu, WSelyutin, OAgrawal, SFeld, BHuang, HCLi, CCheng, KCShih, NYKozlowski, JARosenblum, SBNjoroge, FG Structure-activity relationship (SAR) development and discovery of potent indole-based inhibitors of the hepatitis C virus (HCV) NS5B polymerase. J Med Chem 55:754-65 (2012)  
Target
Name:
Cytochrome P450 2D6
Synonyms:
CP2D6_HUMAN CYP2DL1 Cytochrome P450 2D6 (CYP2D6) P450-DB1
Type:
Protein
Mol. Mass.:
55774.82
Organism:
Homo sapiens (Human)
Description:
P10635
Residue:
497
  
Inhibitor
Name:
BDBM50379197
Synonyms:
CHEMBL2011266
Type:
Small organic molecule
Emp. Form.:
C25H20F3N3O4S
Mol. Mass.:
515.504
SMILES:
Cc1cc2c(c(C(=O)NS(=O)(=O)C3CC3)n(Cc3cc(F)ccc3F)c2cc1F)-c1ccc[nH]c1=O
: