Target
Dipeptidyl peptidase 4
Ligand
BDBM50382273
Substrate
Meas. Tech.
ChEMBL_816258 (CHEMBL2026783)
IC50
>100000±n/a nM
Citation
 Ryabtsova, OJansen, KVan Goethem, SJoossens, JCheng, JDLambeir, AMDe Meester, IAugustyns, KVan der Veken, P Acylated Gly-(2-cyano)pyrrolidines as inhibitors of fibroblast activation protein (FAP) and the issue of FAP/prolyl oligopeptidase (PREP)-selectivity. Bioorg Med Chem Lett 22:3412-7 (2012)  
Target
Name:
Dipeptidyl peptidase 4
Synonyms:
ADABP Adenosine deaminase complexing protein 2 CD_antigen=CD26 DPP4 DPPIV Dipeptidyl peptidase 4 (DPP IV) Dipeptidyl peptidase 4 (DPP4) Dipeptidyl peptidase 4 membrane form Dipeptidyl peptidase IV Dipeptidyl peptidase IV (DDP-IV) Dipeptidyl peptidase IV membrane form Dipeptidyl peptidase-IV (DPP-4) T-cell activation antigen CD26 | TP103
Type:
Enzyme
Mol. Mass.:
88271.01
Organism:
Homo sapiens (Human)
Description:
P27487
Residue:
766
  
Inhibitor
Name:
BDBM50382273
Synonyms:
CHEMBL2022520
Type:
Small organic molecule
Emp. Form.:
C28H31F2N5O3
Mol. Mass.:
523.5742
SMILES:
Fc1ccc(cc1)C(N1CCN(CC1)C(=O)CCC(=O)NCC(=O)N1CCC[C@H]1C#N)c1ccc(F)cc1
: