Target
Cell division cycle 7-related protein kinase
Ligand
BDBM50383729
Substrate
Meas. Tech.
ChEMBL_819143 (CHEMBL2034663)
IC50
>40000±n/a nM
Citation
 Koltun, ESTsuhako, ALBrown, DSAay, NArcalas, AChan, VDu, HEngst, SFerguson, KFranzini, MGalan, AHolst, CRHuang, PKane, BKim, MHLi, JMarkby, DMohan, MNoson, KPlonowski, ARichards, SJRobertson, SShaw, KStott, GStout, TJYoung, JYu, PZaharia, CAZhang, WZhou, PNuss, JMXu, WKearney, PC Discovery of XL413, a potent and selective CDC7 inhibitor. Bioorg Med Chem Lett 22:3727-31 (2012)  
Target
Name:
Cell division cycle 7-related protein kinase
Synonyms:
CDC7 CDC7L1 Cell division cycle 7-related protein kinase (CDC7) huCdc7
Type:
Protein
Mol. Mass.:
63908.16
Organism:
Homo sapiens (Human)
Description:
O00311
Residue:
574
  
Inhibitor
Name:
BDBM50383729
Synonyms:
CHEMBL2030391
Type:
Small organic molecule
Emp. Form.:
C16H14BrN3O4
Mol. Mass.:
392.204
SMILES:
OC(=O)C1CCN(Cc2nc3c4cc(Br)ccc4oc3c(=O)[nH]2)C1
: