Target
Oxytocin receptor
Ligand
BDBM50384802
Substrate
Meas. Tech.
ChEMBL_821157 (CHEMBL2039699)
Ki
1.26±n/a nM
Citation
 Borthwick, ADLiddle, JDavies, DEExall, AMHamlett, CHickey, DMMason, AMSmith, IENerozzi, FPeace, SPollard, DSollis, SLAllen, MJWoollard, PMPullen, MAWestfall, TDStanislaus, DJ Pyridyl-2,5-diketopiperazines as potent, selective, and orally bioavailable oxytocin antagonists: synthesis, pharmacokinetics, and in vivo potency. J Med Chem 55:783-96 (2012)  
Target
Name:
Oxytocin receptor
Synonyms:
OT-R OXYR_HUMAN | Oxytocin
Type:
Enzyme Catalytic Domain
Mol. Mass.:
42793.26
Organism:
Homo sapiens (Human)
Description:
Oxytocin OXTR HEK293::B2R9L7
Residue:
389
  
Inhibitor
Name:
BDBM50384802
Synonyms:
CHEMBL2037503
Type:
Small organic molecule
Emp. Form.:
C27H34N4O3
Mol. Mass.:
462.5839
SMILES:
CC[C@H](C)[C@H]1N([C@@H](C(=O)NC)c2cc(C)cnc2C)C(=O)[C@H](NC1=O)C1Cc2ccccc2C1
: