Target
Serine/threonine-protein kinase pim-2
Ligand
BDBM50385068
Substrate
Meas. Tech.
ChEMBL_821479 (CHEMBL2038009)
IC50
>5000±n/a nM
Citation
 Tsuhako, ALBrown, DSKoltun, ESAay, NArcalas, AChan, VDu, HEngst, SFranzini, MGalan, AHuang, PJohnston, SKane, BKim, MHLaird, ADLin, RMock, LNgan, IPack, MStott, GStout, TJYu, PZaharia, CZhang, WZhou, PNuss, JMKearney, PCXu, W The design, synthesis, and biological evaluation of PIM kinase inhibitors. Bioorg Med Chem Lett 22:3732-8 (2012)  
Target
Name:
Serine/threonine-protein kinase pim-2
Synonyms:
PIM2 Pim-2h Serine/threonine-protein kinase PIM | Serine/threonine-protein kinase pim-2 (PIM2)
Type:
Serine/threonine-protein kinase
Mol. Mass.:
34185.93
Organism:
Homo sapiens (Human)
Description:
Q9P1W9
Residue:
311
  
Inhibitor
Name:
BDBM50385068
Synonyms:
CHEMBL2035618
Type:
Small organic molecule
Emp. Form.:
C17H11BrN2O3
Mol. Mass.:
371.185
SMILES:
COc1ccccc1-c1nc2c3cc(Br)ccc3oc2c(=O)[nH]1
: