Target
Cytochrome P450 2C19
Ligand
BDBM50383725
Substrate
Meas. Tech.
ChEMBL_821515 (CHEMBL2038183)
IC50
>20000±n/a nM
Citation
 Tsuhako, ALBrown, DSKoltun, ESAay, NArcalas, AChan, VDu, HEngst, SFranzini, MGalan, AHuang, PJohnston, SKane, BKim, MHLaird, ADLin, RMock, LNgan, IPack, MStott, GStout, TJYu, PZaharia, CZhang, WZhou, PNuss, JMKearney, PCXu, W The design, synthesis, and biological evaluation of PIM kinase inhibitors. Bioorg Med Chem Lett 22:3732-8 (2012)  
Target
Name:
Cytochrome P450 2C19
Synonyms:
(R)-limonene 6-monooxygenase (S)-limonene 7-monooxygenase CYP2C19 CYPIIC19 Cytochrome P450 2C19 [I331V] Cytochrome P450-254C Mephenytoin 4-hydroxylase P450-254C
Type:
Enzyme
Mol. Mass.:
55935.47
Organism:
Homo sapiens (Human)
Description:
P33261
Residue:
490
  
Inhibitor
Name:
BDBM50383725
Synonyms:
CHEMBL2030386
Type:
Small organic molecule
Emp. Form.:
C15H14BrN3O3
Mol. Mass.:
364.194
SMILES:
O[C@@H]1CCN(Cc2nc3c4cc(Br)ccc4oc3c(=O)[nH]2)C1
: