Target
D-alanyl-D-alanine carboxypeptidase
Ligand
BDBM50385267
Substrate
Meas. Tech.
ChEMBL_822544 (CHEMBL2039477)
Ki
1500±n/a nM
Citation
 Zervosen, ABouillez, AHerman, AAmoroso, AJoris, BSauvage, ECharlier, PLuxen, A Synthesis and evaluation of boronic acids as inhibitors of Penicillin Binding Proteins of classes A, B and C. Bioorg Med Chem 20:3915-24 (2012)  
Target
Name:
D-alanyl-D-alanine carboxypeptidase
Synonyms:
DAC_ACTSP | dac
Type:
PROTEIN
Mol. Mass.:
54928.46
Organism:
Actinomadura sp. (strain R39)
Description:
ChEMBL_822544
Residue:
538
  
Inhibitor
Name:
BDBM50385267
Synonyms:
CHEMBL2035284
Type:
Small organic molecule
Emp. Form.:
C10H14BNO5
Mol. Mass.:
239.033
SMILES:
COc1cccc(OC)c1C(=O)NCB(O)O
: