Target
Tryptophan 2,3-dioxygenase
Ligand
BDBM50289137
Substrate
Meas. Tech.
ChEMBL_825689 (CHEMBL2044106)
IC50
1300±n/a nM
Citation
 Moineaux, LLaurent, SReniers, JDolušic, EGalleni, MFrère, JMMasereel, BFrédérick, RWouters, J Synthesis, crystal structures and electronic properties of isomers of chloro-pyridinylvinyl-1H-indoles. Eur J Med Chem 54:95-102 (2012)  
Target
Name:
Tryptophan 2,3-dioxygenase
Synonyms:
T23O_HUMAN TDO2 TRPO Tryptophan oxygenase Tryptophanase
Type:
PROTEIN
Mol. Mass.:
47874.48
Organism:
Homo sapiens (Human)
Description:
ChEMBL_825691
Residue:
406
  
Inhibitor
Name:
BDBM50289137
Synonyms:
6-Fluoro-3-((E)-2-pyridin-3-yl-vinyl)-1H-indole US10155972, Compound 680C91
Type:
Small organic molecule
Emp. Form.:
C15H11FN2
Mol. Mass.:
238.2596
SMILES:
Fc1ccc2c(\C=C\c3cccnc3)c[nH]c2c1
: