Target
Phosphatidylinositol 4,5-bisphosphate 3-kinase catalytic subunit gamma isoform
Ligand
BDBM50387544
Substrate
Meas. Tech.
ChEMBL_830191 (CHEMBL2062041)
IC50
2.51±n/a nM
Citation
 Ellard, KSunose, MBell, KRamsden, NBergamini, GNeubauer, G Discovery of novel PI3K¿/d inhibitors as potential agents for inflammation. Bioorg Med Chem Lett 22:4546-9 (2012)  
Target
Name:
Phosphatidylinositol 4,5-bisphosphate 3-kinase catalytic subunit gamma isoform
Synonyms:
PI3-kinase p110 subunit gamma PI3Kgamma PK3CG_HUMAN Phosphatidylinositol 4,5-bisphosphate 3-kinase (PI3K) Phosphatidylinositol 4,5-bisphosphate 3-kinase catalytic subunit gamma (PI3Kgamma) Phosphatidylinositol 4,5-bisphosphate 3-kinase catalytic subunit gamma isoform (PI3K) Phosphatidylinositol-4,5-bisphosphate 3-kinase catalytic subunit gamma isoform Phosphoinositide 3-kinases gamma (PI3K gamma) p120-PI3K
Type:
Enzyme Subunit
Mol. Mass.:
126470.30
Organism:
Homo sapiens (Human)
Description:
P48736
Residue:
1102
  
Inhibitor
Name:
BDBM50387544
Synonyms:
CHEMBL2057373
Type:
Small organic molecule
Emp. Form.:
C23H31N9O4S
Mol. Mass.:
529.615
SMILES:
CN1CCN(CC1)C(=O)CNC(=O)Nc1nc2ccc(cn2n1)-c1cncc(c1)S(=O)(=O)NC(C)(C)C
: