Target
Histone deacetylase 2
Ligand
BDBM50387966
Substrate
Meas. Tech.
ChEMBL_829148 (CHEMBL2059970)
IC50
320±n/a nM
Citation
 Vaidya, ASKarumudi, BMendonca, EMadriaga, AAbdelkarim, Hvan Breemen, RBPetukhov, PA Design, synthesis, modeling, biological evaluation and photoaffinity labeling studies of novel series of photoreactive benzamide probes for histone deacetylase 2. Bioorg Med Chem Lett 22:5025-30 (2012)  
Target
Name:
Histone deacetylase 2
Synonyms:
Cereblon/Histone deacetylase 2 HDAC2 Histone deacetylase 2 (HDAC2) | Human HDAC2
Type:
Chromatin regulator; hydrolase; repressor
Mol. Mass.:
55356.54
Organism:
Homo sapiens (Human)
Description:
Q92769
Residue:
488
  
Inhibitor
Name:
BDBM50387966
Synonyms:
CHEMBL2057820
Type:
Small organic molecule
Emp. Form.:
C28H24N6O3
Mol. Mass.:
492.5286
SMILES:
Nc1ccc(cc1NC(=O)c1ccc(CNC(=O)OCc2cccc(c2)N=[N+]=[N-])cc1)-c1ccccc1
: