Target
Neuropeptide Y receptor type 5
Ligand
BDBM50390219
Substrate
Meas. Tech.
ChEMBL_834924 (CHEMBL2073334)
IC50
0.16±n/a nM
Citation
 Tamura, YOmori, NKouyama, NNishiura, YHayashi, KWatanabe, KTanaka, YChiba, TYukioka, HSato, HOkuno, T Design, synthesis and identification of novel benzimidazole derivatives as highly potent NPY Y5 receptor antagonists with attractive in vitro ADME profiles. Bioorg Med Chem Lett 22:5498-502 (2012)  
Target
Name:
Neuropeptide Y receptor type 5
Synonyms:
NPY-Y5 Neuropeptide Y receptor Y5 Npy5 | Npy5r
Type:
Enzyme
Mol. Mass.:
52807.91
Organism:
Mus musculus (Mouse)
Description:
O70342
Residue:
466
  
Inhibitor
Name:
BDBM50390219
Synonyms:
CHEMBL2070148
Type:
Small organic molecule
Emp. Form.:
C21H17FN2O2S
Mol. Mass.:
380.435
SMILES:
CCS(=O)(=O)c1ccc2nc([nH]c2c1)-c1ccc(F)c(c1)-c1ccccc1
: